BDBM50073040 1N-[1-(1H-3-indolylmethyl)-2-oxo-2-spiro[2,3-dihydro-1H-indene-2,3'-(hexahydropyridine)]-1-yl-(1R)-ethyl]-2-amino-2-methylpropanamide::CHEMBL427806
SMILES CC(C)(N)C(=O)N[C@H](Cc1c[nH]c2ccccc12)C(=O)N1CCCC2(Cc3ccccc3C2)C1
InChI Key InChIKey=BOSKKDVVDONTDC-XMMPIXPASA-N
Data  1 EC50
  Tab Delimited (TSV)   2D SDfile   Computed 3D by Vconf -m prep SDfile
Find this compound or compounds like it in BindingDB:
Activity Spreadsheet -- Enzyme Inhibition Constant Data from BindingDB
Found 1 hit for monomerid = 50073040
TargetGrowth hormone secretagogue receptor type 1(Rattus norvegicus)
Merck Research Laboratories
Curated by ChEMBL
LigandPNGBDBM50073040(1N-[1-(1H-3-indolylmethyl)-2-oxo-2-spiro[2,3-dihyd...)
Affinity DataEC50:  60nM. Assay description: In vitro growth hormone release was determined in rat pituitary cell assay
In DepthDetails ArticlePubMed