BDBM50073041 1N-[2-(1,3,4,4a,5,10a-hexahydro-2H-chromeno[2,3-c]pyridin-2-yl)-1-(1H-3-indolylmethyl)-2-oxo-(1R)-ethyl]-2-amino-2-methylpropanamide::CHEMBL13930
SMILES CC(C)(N)C(=O)N[C@H](Cc1c[nH]c2ccccc12)C(=O)N1CCC2(CC1)CCc1ccccc1O2
InChI Key InChIKey=GKDDEWIPWZXMHC-HSZRJFAPSA-N
Data  1 EC50
  Tab Delimited (TSV)   2D SDfile   Computed 3D by Vconf -m prep SDfile
Find this compound or compounds like it in BindingDB:
Activity Spreadsheet -- Enzyme Inhibition Constant Data from BindingDB
Found 1 hit for monomerid = 50073041
TargetGrowth hormone secretagogue receptor type 1(Rattus norvegicus)
Merck Research Laboratories
Curated by ChEMBL
LigandPNGBDBM50073041(1N-[2-(1,3,4,4a,5,10a-hexahydro-2H-chromeno[2,3-c]...)
Affinity DataEC50:  25nM. Assay description: In vitro growth hormone release was determined in rat pituitary cell assay
In DepthDetails ArticlePubMed