BDBM50076126 (S)-2-({5-[(1H-Imidazol-4-ylmethyl)-amino]-biphenyl-2-carbonyl}-amino)-4-methyl-pentanoic acid::CHEMBL281738
SMILES CC(C)C[C@H](NC(=O)c1ccc(NCc2cnc[nH]2)cc1-c1ccccc1)C(O)=O
InChI Key InChIKey=KZMSAVPDHMHSQO-NRFANRHFSA-N
Data  3 IC50
  Tab Delimited (TSV)   2D SDfile   Computed 3D by Vconf -m prep SDfile
Find this compound or compounds like it in BindingDB:
Activity Spreadsheet -- Enzyme Inhibition Constant Data from BindingDB
Found 3 hits for monomerid = 50076126
LigandPNGBDBM50076126((S)-2-({5-[(1H-Imidazol-4-ylmethyl)-amino]-bipheny...)
Affinity DataIC50: >1.00E+4nM. Assay description: In vivo for inhibition of farnesylation based on the inhibition of H-Ras processing.
In DepthDetails ArticlePubMed
TargetDimer of Protein farnesyltransferase subunit beta(Homo sapiens (Human))
Yale University
Curated by ChEMBL
LigandPNGBDBM50076126((S)-2-({5-[(1H-Imidazol-4-ylmethyl)-amino]-bipheny...)
Affinity DataIC50:  1.30E+3nM. Assay description: In vitro inhibition of [3H]-FPP incorporation into H-Ras-CVLS by Farnesyl transferase
In DepthDetails ArticlePubMed
LigandPNGBDBM50076126((S)-2-({5-[(1H-Imidazol-4-ylmethyl)-amino]-bipheny...)
Affinity DataIC50:  90nM. Assay description: In vitro inhibition of [3H]-GGPP incorporation into H-Ras-CVLL by Geranylgeranyl transferase type I
In DepthDetails ArticlePubMed