BDBM50076158 2-((2S,5R)-2-(4-nitrobenzyl)-5-(mercaptomethyl)-3,6-dioxopiperazin-1-yl)-N-tert-butyl-4-methylpentanamide::2-[(3R,6S)-3-Mercaptomethyl-6-(4-nitro-benzyl)-2,5-dioxo-piperazin-1-yl]-4-methyl-pentanoic acid tert-butylamide::CHEMBL287632
SMILES CC(C)CC(N1[C@@H](Cc2ccc(cc2)[N+]([O-])=O)C(=O)N[C@@H](CS)C1=O)C(=O)NC(C)(C)C
InChI Key InChIKey=FXAWYNXKIRKVPJ-RGBJRUIASA-N
Data  4 IC50
  Tab Delimited (TSV)   2D SDfile   Computed 3D by Vconf -m prep SDfile
Find this compound or compounds like it in BindingDB:
Activity Spreadsheet -- Enzyme Inhibition Constant Data from BindingDB
Found 4 hits for monomerid = 50076158
TargetMatrix metalloproteinase-9(Homo sapiens (Human))
Affymax Research Institute
Curated by ChEMBL
LigandPNGBDBM50076158(2-((2S,5R)-2-(4-nitrobenzyl)-5-(mercaptomethyl)-3,...)
Affinity DataIC50:  570nM. Assay description: Inhibitory activity against Matrix metalloprotease-9
In DepthDetails ArticlePubMed
TargetInterstitial collagenase(Homo sapiens (Human))
Pomona College
Curated by ChEMBL
LigandPNGBDBM50076158(2-((2S,5R)-2-(4-nitrobenzyl)-5-(mercaptomethyl)-3,...)
Affinity DataIC50:  24nM. Assay description: Inhibition of MMP1
In DepthDetails ArticlePubMed
TargetMatrix metalloproteinase-9(Homo sapiens (Human))
Affymax Research Institute
Curated by ChEMBL
LigandPNGBDBM50076158(2-((2S,5R)-2-(4-nitrobenzyl)-5-(mercaptomethyl)-3,...)
Affinity DataIC50:  575nM. Assay description: Inhibition of MMP9
In DepthDetails ArticlePubMed
TargetInterstitial collagenase(Homo sapiens (Human))
Pomona College
Curated by ChEMBL
LigandPNGBDBM50076158(2-((2S,5R)-2-(4-nitrobenzyl)-5-(mercaptomethyl)-3,...)
Affinity DataIC50:  24nM. Assay description: Inhibitory activity against Matrix metalloprotease-1
In DepthDetails ArticlePubMed