BDBM50076161 2-((2S,5R)-2-(4-nitrobenzyl)-5-(mercaptomethyl)-3,6-dioxopiperazin-1-yl)-N-tert-butyl-2-(4-phenoxyphenyl)acetamide::CHEMBL29505::N-tert-Butyl-2-[(3R,6S)-3-mercaptomethyl-6-(4-nitro-benzyl)-2,5-dioxo-piperazin-1-yl]-2-(4-phenoxy-phenyl)-acetamide
SMILES CC(C)(C)NC(=O)C(N1[C@@H](Cc2ccc(cc2)[N+]([O-])=O)C(=O)N[C@@H](CS)C1=O)c1ccc(Oc2ccccc2)cc1
InChI Key InChIKey=CDMGVAYSDQPUKP-NPGWBMRXSA-N
Data  4 IC50
  Tab Delimited (TSV)   2D SDfile   Computed 3D by Vconf -m prep SDfile
Find this compound or compounds like it in BindingDB:
Activity Spreadsheet -- Enzyme Inhibition Constant Data from BindingDB
Found 4 hits for monomerid = 50076161
TargetMatrix metalloproteinase-9(Homo sapiens (Human))
Affymax Research Institute
Curated by ChEMBL
LigandPNGBDBM50076161(2-((2S,5R)-2-(4-nitrobenzyl)-5-(mercaptomethyl)-3,...)
Affinity DataIC50:  4.40E+3nM. Assay description: Inhibitory activity against Matrix metalloprotease-9
In DepthDetails ArticlePubMed
TargetMatrix metalloproteinase-9(Homo sapiens (Human))
Affymax Research Institute
Curated by ChEMBL
LigandPNGBDBM50076161(2-((2S,5R)-2-(4-nitrobenzyl)-5-(mercaptomethyl)-3,...)
Affinity DataIC50:  4.37E+3nM. Assay description: Inhibition of MMP9
In DepthDetails ArticlePubMed
TargetInterstitial collagenase(Homo sapiens (Human))
Pomona College
Curated by ChEMBL
LigandPNGBDBM50076161(2-((2S,5R)-2-(4-nitrobenzyl)-5-(mercaptomethyl)-3,...)
Affinity DataIC50:  107nM. Assay description: Inhibition of MMP1
In DepthDetails ArticlePubMed
TargetInterstitial collagenase(Homo sapiens (Human))
Pomona College
Curated by ChEMBL
LigandPNGBDBM50076161(2-((2S,5R)-2-(4-nitrobenzyl)-5-(mercaptomethyl)-3,...)
Affinity DataIC50:  108nM. Assay description: Inhibitory activity against Matrix metalloprotease-1
In DepthDetails ArticlePubMed