BDBM50076338 (S)-3-(4-Fluoro-phenyl)-N-methyl-2-[3-(5-thioxo-4,5-dihydro-[1,3,4]thiadiazol-2-yl)-ureido]-propionamide::CHEMBL40790
SMILES CNC(=O)[C@H](Cc1ccc(F)cc1)NC(=O)Nc1nnc(S)s1
InChI Key InChIKey=GYHXBKOKZOVYIA-VIFPVBQESA-N
Data  2 KI
  Tab Delimited (TSV)   2D SDfile   Computed 3D by Vconf -m prep SDfile
Find this compound or compounds like it in BindingDB:
Activity Spreadsheet -- Enzyme Inhibition Constant Data from BindingDB
Found 1 hit for monomerid = 50076338
TargetStromelysin-1(Homo sapiens (Human))
Pharmacia And Upjohn
Curated by ChEMBL
LigandPNGBDBM50076338((S)-3-(4-Fluoro-phenyl)-N-methyl-2-[3-(5-thioxo-4,...)
Affinity DataKi:  100nM. Assay description: Binding affinity for matrix metalloproteinase-3
In DepthDetails ArticlePubMed