BDBM50076728 (S)-5-(3,4-Diamino-phenyl)-2-(naphthalene-2-sulfonylamino)-pent-4-ynoic acid cyclopentyl-methyl-amide::CHEMBL266551
SMILES CN(C1CCCC1)C(=O)[C@H](CC#Cc1ccc(N)c(N)c1)NS(=O)(=O)c1ccc2ccccc2c1
InChI Key InChIKey=IQPNICBDXUHUJG-SANMLTNESA-N
Data  1 KI
  Tab Delimited (TSV)   2D SDfile   Computed 3D by Vconf -m prep SDfile
Find this compound or compounds like it in BindingDB:
Activity Spreadsheet -- Enzyme Inhibition Constant Data from BindingDB
Found 1 hit for monomerid = 50076728
TargetProthrombin(Homo sapiens (Human))
Biotech Research Institute
Curated by ChEMBL
LigandPNGBDBM50076728((S)-5-(3,4-Diamino-phenyl)-2-(naphthalene-2-sulfon...)
Affinity DataKi:  220nM. Assay description: Inhibition of human thrombin
In DepthDetails ArticlePubMed