BDBM50077381 (R)-2-(Dibenzofuran-2-sulfonyl)-1,2,3,4-tetrahydro-isoquinoline-3-carboxylic acid hydroxyamide::CHEMBL301884
SMILES ONC(=O)[C@H]1Cc2ccccc2CN1S(=O)(=O)c1ccc2oc3ccccc3c2c1
InChI Key InChIKey=WVJHDQDLYDFIKS-LJQANCHMSA-N
Data  1 IC50
  Tab Delimited (TSV)   2D SDfile   Computed 3D by Vconf -m prep SDfile
Find this compound or compounds like it in BindingDB:
Activity Spreadsheet -- Enzyme Inhibition Constant Data from BindingDB
Found 1 hit for monomerid = 50077381
TargetNeutrophil collagenase(Homo sapiens (Human))
Hoechst Marion Roussel
Curated by ChEMBL
LigandPNGBDBM50077381((R)-2-(Dibenzofuran-2-sulfonyl)-1,2,3,4-tetrahydro...)
Affinity DataIC50:  10nM. Assay description: Inhibition of human neutrophil collagenase [Matrix Metalloprotease-8, MMP-8]
In DepthDetails ArticlePubMed