BDBM50078228 2-(2,6-Dichloro-phenyl)-7-ethyl-5-(2-methoxy-phenyl)-5H-thiazolo[3,2-a]pyrimidine-6-carboxylic acid 2-dimethylamino-ethyl ester::CHEMBL41242
SMILES CCC1=C(C(N2C=C(SC2=N1)c1c(Cl)cccc1Cl)c1ccccc1OC)C(=O)OCCN(C)C
InChI Key InChIKey=VNUCNKCATYSOBV-UHFFFAOYSA-N
Data  1 KI
  Tab Delimited (TSV)   2D SDfile   Computed 3D by Vconf -m prep SDfile
Find this compound or compounds like it in BindingDB:
Activity Spreadsheet -- Enzyme Inhibition Constant Data from BindingDB
Found 1 hit for monomerid = 50078228
TargetMetabotropic glutamate receptor 2(Rattus norvegicus)
F. Hoffmann-La Roche
Curated by ChEMBL
LigandPNGBDBM50078228(2-(2,6-Dichloro-phenyl)-7-ethyl-5-(2-methoxy-pheny...)
Affinity DataKi:  1.00E+3nM. Assay description: Inhibition of 1S,3R-ACPD (10 microM) -stimulated GTP gamma 35S binding on rat Metabotropic glutamate receptor 2 transfected in CHO cells
In DepthDetails ArticlePubMed