BDBM50078229 2-(2,6-Dichloro-phenyl)-5-(3-methoxy-phenyl)-7-methyl-5H-thiazolo[3,2-a]pyrimidine-6-carboxylic acid 2-dimethylamino-ethyl ester::CHEMBL288902
SMILES COc1cccc(c1)C1N2C=C(SC2=NC(C)=C1C(=O)OCCN(C)C)c1c(Cl)cccc1Cl
InChI Key InChIKey=NMNYYJCTQPXJPZ-UHFFFAOYSA-N
Data  1 KI
  Tab Delimited (TSV)   2D SDfile   Computed 3D by Vconf -m prep SDfile
Find this compound or compounds like it in BindingDB:
Activity Spreadsheet -- Enzyme Inhibition Constant Data from BindingDB
Found 1 hit for monomerid = 50078229
TargetMetabotropic glutamate receptor 2(Rattus norvegicus)
F. Hoffmann-La Roche
Curated by ChEMBL
LigandPNGBDBM50078229(2-(2,6-Dichloro-phenyl)-5-(3-methoxy-phenyl)-7-met...)
Affinity DataKi:  2.00E+3nM. Assay description: Inhibition of 1S,3R-ACPD (10 microM) -stimulated GTP gamma 35S binding on rat Metabotropic glutamate receptor 2 transfected in CHO cells
In DepthDetails ArticlePubMed