BDBM50081737 4-{5-[1-Aza-bicyclo[2.2.2]oct-(3E)-ylidenemethyl]-isoxazol-3-yl}-phenol::CHEMBL329782
SMILES Oc1ccc(cc1)-c1cc(\C=C2\CN3CCC2CC3)on1
InChI Key InChIKey=CJYCHJNLSAMLSW-ZROIWOOFSA-N
Data  1 IC50
  Tab Delimited (TSV)   2D SDfile   Computed 3D by Vconf -m prep SDfile
Find this compound or compounds like it in BindingDB:
Activity Spreadsheet -- Enzyme Inhibition Constant Data from BindingDB
Found 1 hit for monomerid = 50081737
TargetNeuronal acetylcholine receptor subunit alpha-7(Rattus norvegicus (Rat))
Institute Of Science And Technology
Curated by ChEMBL
LigandPNGBDBM50081737(4-{5-[1-Aza-bicyclo[2.2.2]oct-(3E)-ylidenemethyl]-...)
Affinity DataIC50:  695nM. Assay description: The compound was tested for its binding affinity against nicotinic receptor in synaptic membrane fractions from rat cerebral cortices.
In DepthDetails ArticlePubMed