BDBM50083095 CHEMBL146150::N-[4-((R)-1-{1-[3-(5-[1,2,4]Triazol-4-yl-1H-indol-3-yl)-propyl]-piperidin-4-ylamino}-ethyl)-phenyl]-acetamide
SMILES C[C@@H](NC1CCN(CCCc2c[nH]c3ccc(cc23)-n2cnnc2)CC1)c1ccc(NC(C)=O)cc1
InChI Key InChIKey=WCLJFDNBKNDNOE-HXUWFJFHSA-N
Data  2 IC50
  Tab Delimited (TSV)   2D SDfile   Computed 3D by Vconf -m prep SDfile
Find this compound or compounds like it in BindingDB:
Activity Spreadsheet -- Enzyme Inhibition Constant Data from BindingDB
Found 2 hits for monomerid = 50083095
Target5-hydroxytryptamine receptor 1B(Homo sapiens (Human))
Merck Sharp & Dohme Research Laboratories
Curated by ChEMBL
LigandPNGBDBM50083095(CHEMBL146150 | N-[4-((R)-1-{1-[3-(5-[1,2,4]Triazol...)
Affinity DataIC50:  350nM. Assay description: Binding affinity at cloned human 5-hydroxytryptamine 1B receptor stably expressed in CHO cells by [3H]-5-HT displacement.
In DepthDetails ArticlePubMed
Target5-hydroxytryptamine receptor 1D(Homo sapiens (Human))
Merck Sharp & Dohme Research Laboratories
Curated by ChEMBL
LigandPNGBDBM50083095(CHEMBL146150 | N-[4-((R)-1-{1-[3-(5-[1,2,4]Triazol...)
Affinity DataIC50:  29nM. Assay description: Binding affinity at human cloned 5-hydroxytryptamine 1D receptor stably expressed in CHO cells by [3H]-5-HT displacement.
In DepthDetails ArticlePubMed