BDBM50083162 CHEMBL424310::{(S)-2-[(S)-2-Amino-3-(4-hydroxy-2,6-dimethyl-phenyl)-propionyl]-1,2,3,4-tetrahydro-isoquinolin-3-yl}-acetic acid
SMILES Cc1cc(O)cc(C)c1C[C@H](N)C(=O)N1Cc2ccccc2C[C@H]1CC(O)=O
InChI Key InChIKey=QCIVCYVDUSZRHX-PXNSSMCTSA-N
Data  3 KI
  Tab Delimited (TSV)   2D SDfile   Computed 3D by Vconf -m prep SDfile
Find this compound or compounds like it in BindingDB:
Activity Spreadsheet -- Enzyme Inhibition Constant Data from BindingDB
Found 3 hits for monomerid = 50083162
TargetDelta-type opioid receptor(Rattus norvegicus (rat))
University Of Ferrara
Curated by ChEMBL
LigandPNGBDBM50083162(CHEMBL424310 | {(S)-2-[(S)-2-Amino-3-(4-hydroxy-2,...)
Affinity DataKi:  0.710nM. Assay description: Binding affinity at Opioid receptor delta 1 from rat brain synaptosomal preparations by H-Dmt-Tic-OH displacement.
In DepthDetails ArticlePubMed
TargetDelta-type opioid receptor(Rattus norvegicus (rat))
University Of Ferrara
Curated by ChEMBL
LigandPNGBDBM50083162(CHEMBL424310 | {(S)-2-[(S)-2-Amino-3-(4-hydroxy-2,...)
Affinity DataKi:  0.850nM. Assay description: Binding affinity at Opioid receptor delta 1 from rat brain synaptosomal preparations by [3H]N,N-(Me)2-Dmt-Tic-OH displacement.
In DepthDetails ArticlePubMed
TargetMu-type opioid receptor(Rattus norvegicus (rat))
University Of Ferrara
Curated by ChEMBL
LigandPNGBDBM50083162(CHEMBL424310 | {(S)-2-[(S)-2-Amino-3-(4-hydroxy-2,...)
Affinity DataKi:  418nM. Assay description: Binding affinity at Opioid receptor mu 1 from rat brain synaptosomal preparations by [3H]-DAGO displacement.
In DepthDetails ArticlePubMed