BDBM50083978 CHEMBL558181::N-(6-Amino-hexyl)-2-(2-naphthalen-2-yl-4-oxo-6-phenyl-4H-quinazolin-3-yl)-acetamide; hydrochloride
SMILES NCCCCCCNC(=O)Cn1c(nc2ccc(cc2c1=O)-c1ccccc1)-c1ccc2ccccc2c1
InChI Key InChIKey=UEIYETLQLNNFNK-UHFFFAOYSA-N
Data  1 IC50
  Tab Delimited (TSV)   2D SDfile   Computed 3D by Vconf -m prep SDfile
Find this compound or compounds like it in BindingDB:
Activity Spreadsheet -- Enzyme Inhibition Constant Data from BindingDB
Found 1 hit for monomerid = 50083978
TargetGrowth hormone secretagogue receptor type 1(Homo sapiens (Human))
Merck Research Laboratories
Curated by ChEMBL
LigandPNGBDBM50083978(CHEMBL558181 | N-(6-Amino-hexyl)-2-(2-naphthalen-2...)
Affinity DataIC50:  200nM. Assay description: Binding affinity for human growth hormone GH secretagogue (hGHsr) receptor
In DepthDetails ArticlePubMed