BDBM50084379 CHEMBL3425978
SMILES CCO[C@]1(Oc2ccc(CCO)cc2O[C@@H]1O)c1ccc(O)c(O)c1
InChI Key InChIKey=VXWXVVWPSQAFLR-ROUUACIJSA-N
Data  1 IC50
  Tab Delimited (TSV)   2D SDfile   Computed 3D by Vconf -m prep SDfile
Find this compound or compounds like it in BindingDB:
Activity Spreadsheet -- Enzyme Inhibition Constant Data from BindingDB
Found 1 hit for monomerid = 50084379
TargetProstaglandin G/H synthase 2(Homo sapiens (Human))
Chinese Academy Of Sciences
Curated by ChEMBL
LigandPNGBDBM50084379(CHEMBL3425978)
Affinity DataIC50:  2.52E+3nM. Assay description: Inhibition of human recombinant COX2 pre-incubated for 15 mins followed by addition of heme and fluorometric substrate and further incubated for 15 m...
In DepthDetails ArticlePubMed