BDBM50084846 1-[7-(4-amino-1-quinoliniumylmethyl)-9H-2-fluorenylmethyl]-4-quinoliniumamine::CHEMBL6356
SMILES [NH2+]=c1ccn(Cc2ccc-3c(Cc4cc(Cn5ccc(=[NH2+])c6ccccc56)ccc-34)c2)c2ccccc12
InChI Key InChIKey=USOMLPZSQWAHIS-UHFFFAOYSA-P
Data  2 IC50
  Tab Delimited (TSV)   2D SDfile   Computed 3D by Vconf -m prep SDfile
Find this compound or compounds like it in BindingDB:
Activity Spreadsheet -- Enzyme Inhibition Constant Data from BindingDB
Found 2 hits for monomerid = 50084846
TargetSmall conductance calcium-activated potassium channel protein 1/2/3(Rattus norvegicus)
University College London
Curated by ChEMBL
LigandPNGBDBM50084846(1-[7-(4-amino-1-quinoliniumylmethyl)-9H-2-fluoreny...)
Affinity DataIC50:  310nM. Assay description: The blocking of apamin-sensitive [Ca2+]-activated K+ (SKCa) channel was assessed by the compounds ability to inhibit the after-hyperpolarization in c...
In DepthDetails ArticlePubMed
LigandPNGBDBM50084846(1-[7-(4-amino-1-quinoliniumylmethyl)-9H-2-fluoreny...)
Affinity DataIC50:  310nM. Assay description: Inhibitory concentration of compound required for SKCa blocking action was assessed from its ability to inhibit After hyperpolarisation (AHP) in cult...
In DepthDetails Article