BDBM50085422 (1S,4R,7S,8aR)-4-((E)-2,4-Dimethyl-oct-2-enoyloxy)-8a-methyl-7-((S)-1-methyl-2-oxo-ethyl)-6-oxo-1,2,3,4,6,7,8,8a-octahydro-naphthalene-1-carboxylic acid::CHEMBL79935
SMILES CCCCC(C)\C=C(/C)C(=O)O[C@@H]1CC[C@H](C(O)=O)[C@@]2(C)CC([C@H](C)C=O)C(=O)C=C12
InChI Key InChIKey=HQTRGVTXQWSLRW-DIMVKVHHSA-N
Data  1 IC50
  Tab Delimited (TSV)   2D SDfile   Computed 3D by Vconf -m prep SDfile
Find this compound or compounds like it in BindingDB:
Activity Spreadsheet -- Enzyme Inhibition Constant Data from BindingDB
Found 1 hit for monomerid = 50085422
TargetIntegrase(Human immunodeficiency virus 1)
Merck Research Laboratories
Curated by ChEMBL
LigandPNGBDBM50085422((1S,4R,7S,8aR)-4-((E)-2,4-Dimethyl-oct-2-enoyloxy)...)
Affinity DataIC50:  1.10E+4nM. Assay description: Inhibitory activity against HIV-1 integrase
In DepthDetails ArticlePubMed