BDBM50085577 5-(4-{2-[1-Biphenyl-4-yl-prop-(E)-ylideneaminooxy]-ethoxy}-benzyl)-thiazolidine-2,4-dione::CHEMBL121719
SMILES CC\C(=N/OCCOc1ccc(Cc2sc(=O)[nH]c2O)cc1)c1ccc(cc1)-c1ccccc1
InChI Key InChIKey=MXBRCAMKOJDCSJ-RMLRFSFXSA-N
Data  2 EC50
  Tab Delimited (TSV)   2D SDfile   Computed 3D by Vconf -m prep SDfile
Find this compound or compounds like it in BindingDB:
Activity Spreadsheet -- Enzyme Inhibition Constant Data from BindingDB
Found 2 hits for monomerid = 50085577
LigandPNGBDBM50085577(5-(4-{2-[1-Biphenyl-4-yl-prop-(E)-ylideneaminooxy]...)
Affinity DataEC50:  1.60E+3nM. Assay description: Transactivation activity at PPARgamma (unknown origin)
In DepthDetails Article
LigandPNGBDBM50085577(5-(4-{2-[1-Biphenyl-4-yl-prop-(E)-ylideneaminooxy]...)
Affinity DataEC50:  1.60E+3nM. Assay description: Peroxisome proliferator activated receptor gamma agonistic activity in HepG2 cells.
In DepthDetails ArticlePubMed