BDBM50085580 5-(4-{3-[1-Biphenyl-4-yl-eth-(E)-ylideneaminooxy]-propoxy}-benzyl)-thiazolidine-2,4-dione::CHEMBL124790
SMILES C\C(=N/OCCCOc1ccc(Cc2sc(=O)[nH]c2O)cc1)c1ccc(cc1)-c1ccccc1
InChI Key InChIKey=JTERXYLVGNWBGV-VUTHCHCSSA-N
Data  1 EC50
  Tab Delimited (TSV)   2D SDfile   Computed 3D by Vconf -m prep SDfile
Find this compound or compounds like it in BindingDB:
Activity Spreadsheet -- Enzyme Inhibition Constant Data from BindingDB
Found 1 hit for monomerid = 50085580
TargetPeroxisome proliferator-activated receptor gamma(Homo sapiens (Human))
Sankyo
Curated by ChEMBL
LigandPNGBDBM50085580(5-(4-{3-[1-Biphenyl-4-yl-eth-(E)-ylideneaminooxy]-...)
Affinity DataEC50: >1.00E+5nM. Assay description: Peroxisome proliferator activated receptor gamma agonistic activity in HepG2 cells.
In DepthDetails ArticlePubMed