BDBM50085735 CHEMBL412681::Cyclo (5-8) [Ac-D Nal, D Cpa, D Pal, Asp, Glu, D Arg, Leu, Aph, Pro, D Ala]GnRH
SMILES CC[C@H](NC(C)=O)C(=O)N[C@@H](Cc1ccc(Cl)cc1)C(=O)N[C@@H](Cc1cccnc1)C(=O)N[C@@H](CC(O)=O)C(=O)N[C@@H]1CCC(=O)Nc2ccc(C[C@H](NC(=O)[C@H](CC(C)C)NC(=O)[C@@H](CCCNC(N)=N)NC1=O)C(=O)N1CCC[C@@H]1C(=O)N[C@@H](C)C(N)=O)cc2
InChI Key InChIKey=TVSDPVWVGLIHAP-NTXBJTMNSA-N
Data  1 KI
  Tab Delimited (TSV)   2D SDfile   Computed 3D by Vconf -m prep SDfile
Find this compound or compounds like it in BindingDB:
Activity Spreadsheet -- Enzyme Inhibition Constant Data from BindingDB
Found 1 hit for monomerid = 50085735
TargetGonadotropin-releasing hormone receptor(Rattus norvegicus)
Salk Institute
Curated by ChEMBL
LigandPNGBDBM50085735(CHEMBL412681 | Cyclo (5-8) [Ac-D Nal, D Cpa, D Pal...)
Affinity DataKi:  0.280nM. Assay description: Competitive radioligand binding assay, in human HEK-293 cells stably transfected with the rat Gonadotropin-releasing hormone receptor
In DepthDetails ArticlePubMed