BDBM50086231 CHEMBL3425513
SMILES OCc1cc(=O)c(O)cn1CCCc1ccccc1
InChI Key InChIKey=ZCVXBLDZFZHPGW-UHFFFAOYSA-N
Data  1 IC50
  Tab Delimited (TSV)   2D SDfile   Computed 3D by Vconf -m prep SDfile
Find this compound or compounds like it in BindingDB:
Activity Spreadsheet -- Enzyme Inhibition Constant Data from BindingDB
Found 1 hit for monomerid = 50086231
TargetCatechol O-methyltransferase(Homo sapiens (Human))
Merck Research Laboratories
Curated by ChEMBL
LigandPNGBDBM50086231(CHEMBL3425513)
Affinity DataIC50:  4.50E+3nM. Assay description: Inhibition of C-terminal His6-tagged recombinant human membrane bound COMT expressed in Bacmid infected Sf-9 insect cells using dopamine/SAM as subst...
In DepthDetails ArticlePubMed