BDBM50087811 CHEMBL3426785
SMILES CC(C)NCCCn1c(Sc2cc3OCOc3cc2N(C)C)nc2c(N)ncnc12
InChI Key InChIKey=RNRUDSDKXMGQLH-UHFFFAOYSA-N
Data  2 IC50
  Tab Delimited (TSV)   2D SDfile   Computed 3D by Vconf -m prep SDfile
Find this compound or compounds like it in BindingDB:
Activity Spreadsheet -- Enzyme Inhibition Constant Data from BindingDB
Found 2 hits for monomerid = 50087811
TargetHeat shock protein HSP 90-alpha(Homo sapiens (Human))
Sloan-Kettering Institute For Cancer Research
Curated by ChEMBL
LigandPNGBDBM50087811(CHEMBL3426785)
Affinity DataIC50:  100nM. Assay description: Displacement of Cy3B-GM from recombinant Hsp90alpha (unknown origin) after 24 hrs by fluorescence polarization assay
In DepthDetails ArticlePubMed
TargetEndoplasmin(Homo sapiens (Human))
Sloan-Kettering Institute For Cancer Research
Curated by ChEMBL
LigandPNGBDBM50087811(CHEMBL3426785)
Affinity DataIC50:  265nM. Assay description: Displacement of Cy3B-GM from recombinant Grp94 (unknown origin) after 24 hrs by fluorescence polarization assay
In DepthDetails ArticlePubMed