BDBM50090445 2-(4-Fluoro-phenyl)-4-[methyl-(3-methyl-2,5-dioxo-2,5-dihydro-pyrrol-1-yl)-amino]-pyrimidine-5-carboxylic acid ethyl ester::CHEMBL43550::ethyl 2-(4-fluorophenyl)-4-(methyl(3-methyl-2,5-dioxo-2H-pyrrol-1(5H)-yl)amino)pyrimidine-5-carboxylate
SMILES CCOC(=O)c1cnc(nc1N(C)N1C(=O)C=C(C)C1=O)-c1ccc(F)cc1
InChI Key InChIKey=GUOXXZUMWRAECQ-UHFFFAOYSA-N
Data  1 IC50
  Tab Delimited (TSV)   2D SDfile   Computed 3D by Vconf -m prep SDfile
Find this compound or compounds like it in BindingDB:
Activity Spreadsheet -- Enzyme Inhibition Constant Data from BindingDB
Found 1 hit for monomerid = 50090445
TargetProtein c-Fos/Transcription factor Jun(Homo sapiens (Human))
Signal Pharmaceuticals
Curated by ChEMBL
LigandPNGBDBM50090445(2-(4-Fluoro-phenyl)-4-[methyl-(3-methyl-2,5-dioxo-...)
Affinity DataIC50:  3.00E+3nM. Assay description: Inhibition of AP-1 (activator protein-1) mediated transcriptional activation in Jurkat T-cells
In DepthDetails ArticlePubMed