BDBM50090616 CHEMBL3581735
SMILES CC(C)(C)c1ccc(NC(=O)N2CCc3cc(cc(N4CCCC4=O)c23)S(=O)(=O)Nc2ccc(F)cc2F)cc1
InChI Key InChIKey=HWIHUBFUVPVQPG-UHFFFAOYSA-N
Data  1 IC50
  Tab Delimited (TSV)   2D SDfile   Computed 3D by Vconf -m prep SDfile
Find this compound or compounds like it in BindingDB:
Activity Spreadsheet -- Enzyme Inhibition Constant Data from BindingDB
Found 1 hit for monomerid = 50090616
TargetAlpha-1,6-mannosyl-glycoprotein 2-beta-N-acetylglucosaminyltransferase(Homo sapiens (Human))
Takeda Pharmaceutical
Curated by ChEMBL
LigandPNGBDBM50090616(CHEMBL3581735)
Affinity DataIC50:  3.60nM. Assay description: In vitro inhibition of full length human MGAT2 transfected in FreeStyle293 cells assessed as dioleoylglycerol by RapidFire/MS assay
In DepthDetails ArticlePubMed