BDBM50091788 CHEMBL293577::N-{4-[2-((R)-2-Hydroxy-2-pyridin-3-yl-ethylamino)-ethyl]-phenyl}-4-(4-quinolin-3-yl-thiazol-2-yl)-benzenesulfonamide
SMILES O[C@@H](CNCCc1ccc(NS(=O)(=O)c2ccc(cc2)-c2nc(cs2)-c2cnc3ccccc3c2)cc1)c1cccnc1
InChI Key InChIKey=DKIKWFPJWNCAOP-YTTGMZPUSA-N
Data  2 IC50  1 EC50
  Tab Delimited (TSV)   2D SDfile   Computed 3D by Vconf -m prep SDfile
Find this compound or compounds like it in BindingDB:
Activity Spreadsheet -- Enzyme Inhibition Constant Data from BindingDB
Found 3 hits for monomerid = 50091788
TargetBeta-2 adrenergic receptor(Homo sapiens (Human))
Merck Research Laboratories
Curated by ChEMBL
LigandPNGBDBM50091788(CHEMBL293577 | N-{4-[2-((R)-2-Hydroxy-2-pyridin-3-...)
Affinity DataIC50:  4.70E+4nM. Assay description: Binding affinity against human Beta-2 adrenergic receptor expressed in CHO cells using [125I]-iodocyanopindolol
In DepthDetails ArticlePubMed
TargetBeta-1 adrenergic receptor(Homo sapiens (Human))
Merck Research Laboratories
Curated by ChEMBL
LigandPNGBDBM50091788(CHEMBL293577 | N-{4-[2-((R)-2-Hydroxy-2-pyridin-3-...)
Affinity DataIC50:  1.90E+4nM. Assay description: Binding affinity (measured using [125I]-iodocyanopindolol) against human Beta-1 adrenergic receptor expressed in CHO cells
In DepthDetails ArticlePubMed
TargetBeta-3 adrenergic receptor(Homo sapiens (Human))
Merck Research Laboratories
Curated by ChEMBL
LigandPNGBDBM50091788(CHEMBL293577 | N-{4-[2-((R)-2-Hydroxy-2-pyridin-3-...)
Affinity DataEC50:  7.30nM. Assay description: Stimulated increase in cAMP in CHO cells expressing human beta-3 receptor
In DepthDetails ArticlePubMed