BDBM50093257 CHEMBL131574::Spiro[1-azabicyclo[2.2.2]octane-3,4'-Pyrrolidin-2-one]
SMILES O=C1CC2(CN1)CN1CCC2CC1
InChI Key InChIKey=UXTQICIVIDYZNW-UHFFFAOYSA-N
Data  1 KI
  Tab Delimited (TSV)   2D SDfile   Computed 3D by Vconf -m prep SDfile
Find this compound or compounds like it in BindingDB:
Activity Spreadsheet -- Enzyme Inhibition Constant Data from BindingDB
Found 1 hit for monomerid = 50093257
TargetNeuronal acetylcholine receptor subunit alpha-7(Rattus norvegicus (Rat))
Astrazeneca R&D Boston
Curated by ChEMBL
LigandPNGBDBM50093257(CHEMBL131574 | Spiro[1-azabicyclo[2.2.2]octane-3,4...)
Affinity DataKi:  4.00E+3nM. Assay description: Binding affinity in rat hippocampi against Nicotinic acetylcholine receptor alpha7
In DepthDetails ArticlePubMed