BDBM50093524 CHEMBL3585680
SMILES Oc1ccc(cc1)-c1cc(=O)c2ccc(O)c(-c3cc([C@@H]4CC(=O)c5c(O)cc(O)cc5O4)c(O)cc3O)c2o1
InChI Key InChIKey=OUSRWWZUFIFHHW-SANMLTNESA-N
Data  1 KI  1 IC50
  Tab Delimited (TSV)   2D SDfile   Computed 3D by Vconf -m prep SDfile
Find this compound or compounds like it in BindingDB:
Activity Spreadsheet -- Enzyme Inhibition Constant Data from BindingDB
Found 2 hits for monomerid = 50093524
TargetTyrosine-protein phosphatase non-receptor type 1(Homo sapiens (Human))
Catholic University Of Daegu
Curated by ChEMBL
LigandPNGBDBM50093524(CHEMBL3585680)
Affinity DataKi:  1.04E+4nM. Assay description: Inhibition of human recombinant PTP1B using p-NPP as substrate preincubated for 10 mins followed by substrate addition measured after 20 mins by micr...
In DepthDetails ArticlePubMed
TargetTyrosine-protein phosphatase non-receptor type 1(Homo sapiens (Human))
Catholic University Of Daegu
Curated by ChEMBL
LigandPNGBDBM50093524(CHEMBL3585680)
Affinity DataIC50:  9.80E+3nM. Assay description: Uncompetitive inhibition of human recombinant PTP1B using p-NPP as substrate preincubated for 10 mins followed by substrate addition measured after 2...
In DepthDetails ArticlePubMed