BDBM50095140 CHEMBL3589516
SMILES Cn1cc(CN2C[C@@H](CN(Cc3ccc(cc3)C#CC(C)(C)O)CC2=O)OCc2cccnc2)cn1
InChI Key InChIKey=AXLBTHPTIVQLAP-UHFFFAOYSA-N
Data  1 IC50
  Tab Delimited (TSV)   2D SDfile   Computed 3D by Vconf -m prep SDfile
Find this compound or compounds like it in BindingDB:
Activity Spreadsheet -- Enzyme Inhibition Constant Data from BindingDB
Found 1 hit for monomerid = 50095140
TargetInhibin beta A chain(Mus musculus)
Northwestern University
Curated by ChEMBL
LigandPNGBDBM50095140(CHEMBL3589516)
Affinity DataIC50:  4.25E+3nM. Assay description: Antagonist activity at activin A in mouse LbetaT2 cells transfected with -338 promoter region of FSHbeta gene conjugated to luciferase reporter asses...
In DepthDetails ArticlePubMed