BDBM50095444 CHEMBL315330::Methyl-phosphonic acid mono-{3-[3-(3-ethylamino-propylamino)-propylamino]-propyl} ester
SMILES CCNCCCNCCCNCCCOP(C)(O)=O
InChI Key InChIKey=YVXWTBUIUBFZPE-UHFFFAOYSA-N
Data  1 KI
  Tab Delimited (TSV)   2D SDfile   Computed 3D by Vconf -m prep SDfile
Find this compound or compounds like it in BindingDB:
Activity Spreadsheet -- Enzyme Inhibition Constant Data from BindingDB
Found 1 hit for monomerid = 50095444
TargetDiamine acetyltransferase 1(Homo sapiens (Human))
Wayne State University
Curated by ChEMBL
LigandPNGBDBM50095444(CHEMBL315330 | Methyl-phosphonic acid mono-{3-[3-(...)
Affinity DataKi:  5.00E+4nM. Assay description: Inhibitory activity against human SSAT
In DepthDetails ArticlePubMed