BDBM50096966 CHEMBL3580906
SMILES NCCOc1ccc(Cc2ccc(O)cc2)cc1
InChI Key InChIKey=LRIDZOOCYXCOKE-UHFFFAOYSA-N
Data  1 EC50
  Tab Delimited (TSV)   2D SDfile   Computed 3D by Vconf -m prep SDfile
Find this compound or compounds like it in BindingDB:
Activity Spreadsheet -- Enzyme Inhibition Constant Data from BindingDB
Found 1 hit for monomerid = 50096966
TargetTrace amine-associated receptor 1(Mus musculus (Mouse))
University Of Pisa
Curated by ChEMBL
LigandPNGBDBM50096966(CHEMBL3580906)
Affinity DataEC50:  2.20E+3nM. Assay description: Agonist activity at mouse TAAR1 expressed in HEK293 cells coexpressing cAMP BRET biosensor assessed as induction of CAMP production after 20 mins by ...
In DepthDetails ArticlePubMed