BDBM50097278 (Carboxymethyl-{2-[carboxymethyl-(2-{carboxymethyl-[(5-chloro-2,4-disulfamoyl-phenylcarbamoyl)-methyl]-amino}-ethyl)-amino]-ethyl}-amino)-acetic acid::CHEMBL290348::{(2-{[2-(Bis-carboxymethyl-amino)-ethyl]-carboxymethyl-amino}-ethyl)-[(5-chloro-2,4-disulfamoyl-phenylcarbamoyl)-methyl]-amino}-acetic acid
SMILES NS(=O)(=O)c1cc(c(NC(=O)CN(CCN(CCN(CC(O)=O)CC(O)=O)CC(O)=O)CC(O)=O)cc1Cl)S(N)(=O)=O
InChI Key InChIKey=AXIMANCGDYFPRM-UHFFFAOYSA-N
Data  6 KI
  Tab Delimited (TSV)   2D SDfile   Computed 3D by Vconf -m prep SDfile
Find this compound or compounds like it in BindingDB:
Activity Spreadsheet -- Enzyme Inhibition Constant Data from BindingDB
Found 6 hits for monomerid = 50097278
TargetCarbonic anhydrase 2(Homo sapiens (Human))
Universit£
Curated by ChEMBL
LigandPNGBDBM50097278((Carboxymethyl-{2-[carboxymethyl-(2-{carboxymethyl...)
Affinity DataKi:  12nM. Assay description: Inhibition of cloned isozyme, human carbonic anhydrase II
In DepthDetails ArticlePubMed
TargetCarbonic anhydrase 2(Homo sapiens (Human))
Universit£
Curated by ChEMBL
LigandPNGBDBM50097278((Carboxymethyl-{2-[carboxymethyl-(2-{carboxymethyl...)
Affinity DataKi:  12nM. Assay description: Inhibitory activity against Human carbonic anhydrase II
In DepthDetails ArticlePubMed
TargetCarbonic anhydrase 4(Bos taurus (bovine))
Universit£
Curated by ChEMBL
LigandPNGBDBM50097278((Carboxymethyl-{2-[carboxymethyl-(2-{carboxymethyl...)
Affinity DataKi:  52nM. Assay description: Inhibitory activity against bovine carbonic anhydrase IV
In DepthDetails ArticlePubMed
TargetCarbonic anhydrase 4(Homo sapiens (Human))
Universit£
Curated by ChEMBL
LigandPNGBDBM50097278((Carboxymethyl-{2-[carboxymethyl-(2-{carboxymethyl...)
Affinity DataKi:  52nM. Assay description: Inhibition of cloned isozyme, human carbonic anhydrase IV
In DepthDetails ArticlePubMed
TargetCarbonic anhydrase 1(Homo sapiens (Human))
Universit£
Curated by ChEMBL
LigandPNGBDBM50097278((Carboxymethyl-{2-[carboxymethyl-(2-{carboxymethyl...)
Affinity DataKi:  87nM. Assay description: Inhibitory activity against Human carbonic anhydrase I
In DepthDetails ArticlePubMed
TargetCarbonic anhydrase 1(Homo sapiens (Human))
Universit£
Curated by ChEMBL
LigandPNGBDBM50097278((Carboxymethyl-{2-[carboxymethyl-(2-{carboxymethyl...)
Affinity DataKi:  87nM. Assay description: Inhibition of cloned isozyme, human carbonic anhydrase I
In DepthDetails ArticlePubMed