BDBM50097290 CHEMBL32208::{{2-[Carboxymethyl-(2-{carboxymethyl-[(2,3-dichloro-4,6-disulfamoyl-phenylcarbamoyl)-methyl]-amino}-ethyl)-amino]-ethyl}-[(2,3-dichloro-4,6-disulfamoyl-phenylcarbamoyl)-methyl]-amino}-acetic acid
SMILES NS(=O)(=O)c1cc(c(NC(=O)CN(CCN(CCN(CC(O)=O)CC(=O)Nc2c(Cl)c(Cl)c(cc2S(N)(=O)=O)S(N)(=O)=O)CC(O)=O)CC(O)=O)c(Cl)c1Cl)S(N)(=O)=O
InChI Key InChIKey=OOLIXLGXVWZENE-UHFFFAOYSA-N
Data  6 KI
  Tab Delimited (TSV)   2D SDfile   Computed 3D by Vconf -m prep SDfile
Find this compound or compounds like it in BindingDB:
Activity Spreadsheet -- Enzyme Inhibition Constant Data from BindingDB
Found 6 hits for monomerid = 50097290
TargetCarbonic anhydrase 2(Homo sapiens (Human))
Universit£
Curated by ChEMBL
LigandPNGBDBM50097290(CHEMBL32208 | {{2-[Carboxymethyl-(2-{carboxymethyl...)
Affinity DataKi:  9nM. Assay description: Inhibitory activity against Human carbonic anhydrase II
In DepthDetails ArticlePubMed
TargetCarbonic anhydrase 2(Homo sapiens (Human))
Universit£
Curated by ChEMBL
LigandPNGBDBM50097290(CHEMBL32208 | {{2-[Carboxymethyl-(2-{carboxymethyl...)
Affinity DataKi:  9nM. Assay description: Inhibition of cloned isozyme, human carbonic anhydrase II
In DepthDetails ArticlePubMed
TargetCarbonic anhydrase 4(Bos taurus (bovine))
Universit£
Curated by ChEMBL
LigandPNGBDBM50097290(CHEMBL32208 | {{2-[Carboxymethyl-(2-{carboxymethyl...)
Affinity DataKi:  25nM. Assay description: Inhibitory activity against bovine carbonic anhydrase IV
In DepthDetails ArticlePubMed
TargetCarbonic anhydrase 4(Homo sapiens (Human))
Universit£
Curated by ChEMBL
LigandPNGBDBM50097290(CHEMBL32208 | {{2-[Carboxymethyl-(2-{carboxymethyl...)
Affinity DataKi:  25nM. Assay description: Inhibition of cloned isozyme, human carbonic anhydrase IV
In DepthDetails ArticlePubMed
TargetCarbonic anhydrase 1(Homo sapiens (Human))
Universit£
Curated by ChEMBL
LigandPNGBDBM50097290(CHEMBL32208 | {{2-[Carboxymethyl-(2-{carboxymethyl...)
Affinity DataKi:  43nM. Assay description: Inhibitory activity against Human carbonic anhydrase I
In DepthDetails ArticlePubMed
TargetCarbonic anhydrase 1(Homo sapiens (Human))
Universit£
Curated by ChEMBL
LigandPNGBDBM50097290(CHEMBL32208 | {{2-[Carboxymethyl-(2-{carboxymethyl...)
Affinity DataKi:  43nM. Assay description: Inhibition of cloned isozyme, human carbonic anhydrase I
In DepthDetails ArticlePubMed