BDBM50097294 ({2-[(2-{[(2-Bromo-4-sulfamoyl-phenylcarbamoyl)-methyl]-carboxymethyl-amino}-ethyl)-carboxymethyl-amino]-ethyl}-carboxymethyl-amino)-acetic acid::CHEMBL34768::{(2-{[2-(Bis-carboxymethyl-amino)-ethyl]-carboxymethyl-amino}-ethyl)-[(2-bromo-4-sulfamoyl-phenylcarbamoyl)-methyl]-amino}-acetic acid
SMILES NS(=O)(=O)c1ccc(NC(=O)CN(CCN(CCN(CC(O)=O)CC(O)=O)CC(O)=O)CC(O)=O)c(Br)c1
InChI Key InChIKey=XWWOZWMZWMFCLV-UHFFFAOYSA-N
Data  6 KI
  Tab Delimited (TSV)   2D SDfile   Computed 3D by Vconf -m prep SDfile
Find this compound or compounds like it in BindingDB:
Activity Spreadsheet -- Enzyme Inhibition Constant Data from BindingDB
Found 6 hits for monomerid = 50097294
TargetCarbonic anhydrase 2(Homo sapiens (Human))
Universit£
Curated by ChEMBL
LigandPNGBDBM50097294(({2-[(2-{[(2-Bromo-4-sulfamoyl-phenylcarbamoyl)-me...)
Affinity DataKi:  12nM. Assay description: Inhibitory activity against Human carbonic anhydrase II
In DepthDetails ArticlePubMed
TargetCarbonic anhydrase 2(Homo sapiens (Human))
Universit£
Curated by ChEMBL
LigandPNGBDBM50097294(({2-[(2-{[(2-Bromo-4-sulfamoyl-phenylcarbamoyl)-me...)
Affinity DataKi:  12nM. Assay description: Inhibition of cloned isozyme, human carbonic anhydrase II
In DepthDetails ArticlePubMed
TargetCarbonic anhydrase 4(Bos taurus (bovine))
Universit£
Curated by ChEMBL
LigandPNGBDBM50097294(({2-[(2-{[(2-Bromo-4-sulfamoyl-phenylcarbamoyl)-me...)
Affinity DataKi:  27nM. Assay description: Inhibitory activity against bovine carbonic anhydrase IV
In DepthDetails ArticlePubMed
TargetCarbonic anhydrase 4(Homo sapiens (Human))
Universit£
Curated by ChEMBL
LigandPNGBDBM50097294(({2-[(2-{[(2-Bromo-4-sulfamoyl-phenylcarbamoyl)-me...)
Affinity DataKi:  27nM. Assay description: Inhibition of cloned isozyme, human carbonic anhydrase IV
In DepthDetails ArticlePubMed
TargetCarbonic anhydrase 1(Homo sapiens (Human))
Universit£
Curated by ChEMBL
LigandPNGBDBM50097294(({2-[(2-{[(2-Bromo-4-sulfamoyl-phenylcarbamoyl)-me...)
Affinity DataKi:  96nM. Assay description: Inhibition of cloned isozyme, human carbonic anhydrase I
In DepthDetails ArticlePubMed
TargetCarbonic anhydrase 1(Homo sapiens (Human))
Universit£
Curated by ChEMBL
LigandPNGBDBM50097294(({2-[(2-{[(2-Bromo-4-sulfamoyl-phenylcarbamoyl)-me...)
Affinity DataKi:  96nM. Assay description: Inhibitory activity against Human carbonic anhydrase I
In DepthDetails ArticlePubMed