BDBM50097302 CHEMBL416410::[Carboxymethyl-(2-{carboxymethyl-[2-(carboxymethyl-{[2-(5-sulfamoyl-[1,3,4]thiadiazol-2-ylcarbamoyl)-ethylcarbamoyl]-methyl}-amino)-ethyl]-amino}-ethyl)-amino]-acetic acid
SMILES NS(=O)(=O)c1nnc(NC(=O)CCNC(=O)CN(CCN(CCN(CC(O)=O)CC(O)=O)CC(O)=O)CC(O)=O)s1
InChI Key InChIKey=ONKCOSCHJAFALI-UHFFFAOYSA-N
Data  6 KI
  Tab Delimited (TSV)   2D SDfile   Computed 3D by Vconf -m prep SDfile
Find this compound or compounds like it in BindingDB:
Activity Spreadsheet -- Enzyme Inhibition Constant Data from BindingDB
Found 6 hits for monomerid = 50097302
TargetCarbonic anhydrase 2(Homo sapiens (Human))
Universit£
Curated by ChEMBL
LigandPNGBDBM50097302(CHEMBL416410 | [Carboxymethyl-(2-{carboxymethyl-[2...)
Affinity DataKi:  1nM. Assay description: Inhibition of cloned isozyme, human carbonic anhydrase II
In DepthDetails ArticlePubMed
TargetCarbonic anhydrase 2(Homo sapiens (Human))
Universit£
Curated by ChEMBL
LigandPNGBDBM50097302(CHEMBL416410 | [Carboxymethyl-(2-{carboxymethyl-[2...)
Affinity DataKi:  1nM. Assay description: Inhibitory activity against Human carbonic anhydrase II
In DepthDetails ArticlePubMed
TargetCarbonic anhydrase 4(Bos taurus (bovine))
Universit£
Curated by ChEMBL
LigandPNGBDBM50097302(CHEMBL416410 | [Carboxymethyl-(2-{carboxymethyl-[2...)
Affinity DataKi:  16nM. Assay description: Inhibitory activity against bovine carbonic anhydrase IV
In DepthDetails ArticlePubMed
TargetCarbonic anhydrase 4(Homo sapiens (Human))
Universit£
Curated by ChEMBL
LigandPNGBDBM50097302(CHEMBL416410 | [Carboxymethyl-(2-{carboxymethyl-[2...)
Affinity DataKi:  16nM. Assay description: Inhibition of cloned isozyme, human carbonic anhydrase IV
In DepthDetails ArticlePubMed
TargetCarbonic anhydrase 1(Homo sapiens (Human))
Universit£
Curated by ChEMBL
LigandPNGBDBM50097302(CHEMBL416410 | [Carboxymethyl-(2-{carboxymethyl-[2...)
Affinity DataKi:  110nM. Assay description: Inhibitory activity against Human carbonic anhydrase I
In DepthDetails ArticlePubMed
TargetCarbonic anhydrase 1(Homo sapiens (Human))
Universit£
Curated by ChEMBL
LigandPNGBDBM50097302(CHEMBL416410 | [Carboxymethyl-(2-{carboxymethyl-[2...)
Affinity DataKi:  110nM. Assay description: Inhibition of cloned isozyme, human carbonic anhydrase I
In DepthDetails ArticlePubMed