BDBM50097417 3'',3'''-Dichloro-5'',5'''-dicarboxy-4'',4'''-di[p-carboxybenzyloxy]-4',4'-diphenyl-3beta-(1-butyl)cholestane::CHEMBL406072
SMILES CC(C)CCCC(C)[C@H]1CCC2C3CCC4C[C@@H](CCCC(c5cc(Cl)c(OCc6ccc(cc6)C(O)=O)c(c5)C(O)=O)c5cc(Cl)c(OCc6ccc(cc6)C(O)=O)c(c5)C(O)=O)CC[C@]4(C)C3CC[C@]12C
InChI Key InChIKey=HPDRPFNZBMXBHZ-IYSNICKISA-N
Data  1 EC50
  Tab Delimited (TSV)   2D SDfile   Computed 3D by Vconf -m prep SDfile
Find this compound or compounds like it in BindingDB:
Activity Spreadsheet -- Enzyme Inhibition Constant Data from BindingDB
Found 1 hit for monomerid = 50097417
TargetT-cell surface glycoprotein CD4(Homo sapiens (Human))
Purdue University
Curated by ChEMBL
LigandPNGBDBM50097417(3'',3'''-Dichloro-5'',5'''-dicarboxy-4'',4'''-di[p...)
Affinity DataEC50:  7.04E+4nM. Assay description: In vitro inhibition of cytopathic effect was determined against HIV-2 ROD in MT-4 cells using MTS cytoprotection assay
In DepthDetails ArticlePubMed