BDBM50097483 CHEMBL3585855
SMILES C[C@H](Cc1ccc(NCc2cc(ccc2O)[N+]([O-])=O)cc1)N(C)CC#C
InChI Key InChIKey=FZYWKJGVKLJEOJ-OAHLLOKOSA-N
Data  1 IC50
  Tab Delimited (TSV)   2D SDfile   Computed 3D by Vconf -m prep SDfile
Find this compound or compounds like it in BindingDB:
Activity Spreadsheet -- Enzyme Inhibition Constant Data from BindingDB
Found 1 hit for monomerid = 50097483
TargetAmine oxidase [flavin-containing] B(Homo sapiens (Human))
Sun Yat-Sen University
Curated by ChEMBL
LigandPNGBDBM50097483(CHEMBL3585855)
Affinity DataIC50:  950nM. Assay description: Inhibition of human recombinant MAO-B using benzylamine as substrate incubated for 15 mins prior to substrate addition measured after 20 mins by fluo...
In DepthDetails ArticlePubMed