BDBM50097618 3-((S)-1-Methyl-pyrrolidin-2-ylmethoxy)-5-phenyl-pyridine::CHEMBL156048
SMILES CN1CCC[C@H]1COc1cncc(c1)-c1ccccc1
InChI Key InChIKey=FIBZQGOAZGUXTL-INIZCTEOSA-N
Data  2 KI
  Tab Delimited (TSV)   2D SDfile   Computed 3D by Vconf -m prep SDfile
Find this compound or compounds like it in BindingDB:
Activity Spreadsheet -- Enzyme Inhibition Constant Data from BindingDB
Found 2 hits for monomerid = 50097618
TargetNeuronal acetylcholine receptor subunit alpha-4/beta-2(Rattus norvegicus (Rat))
Abbott Laboratories
Curated by ChEMBL
LigandPNGBDBM50097618(3-((S)-1-Methyl-pyrrolidin-2-ylmethoxy)-5-phenyl-p...)
Affinity DataKi:  0.110nM. Assay description: In vitro ability to displace [3H]-(-)-cytisine binding to whole rat brain membranes at Nicotinic acetylcholine receptor alpha4-beta2
In DepthDetails ArticlePubMed
TargetNeuronal acetylcholine receptor subunit alpha-4/beta-2(Rattus norvegicus (Rat))
Abbott Laboratories
Curated by ChEMBL
LigandPNGBDBM50097618(3-((S)-1-Methyl-pyrrolidin-2-ylmethoxy)-5-phenyl-p...)
Affinity DataKi:  0.110nM. Assay description: Displacement of [3H]-cytisine from alpha4beta2-nACHR in rat whole brain
In DepthDetails ArticlePubMed