BDBM50097798 CHEMBL163262::N-[5-((R)-2-{1-[4-(2,4-Dioxo-thiazolidin-5-ylmethyl)-phenyl]-piperidin-4-ylamino}-1-hydroxy-ethyl)-2-hydroxy-phenyl]-methanesulfonamide::N-[5-(2-{1-[4-((R)-2,4-Dioxo-thiazolidin-5-ylmethyl)-phenyl]-piperidin-4-ylamino}-1-hydroxy-ethyl)-2-hydroxy-phenyl]-methanesulfonamide
SMILES CS(=O)(=O)Nc1cc(ccc1O)[C@@H](O)CNC1CCN(CC1)c1ccc(Cc2sc(=O)[nH]c2O)cc1
InChI Key InChIKey=UCWNAIHSSOGALM-NRFANRHFSA-N
Data  4 EC50
  Tab Delimited (TSV)   2D SDfile   Computed 3D by Vconf -m prep SDfile
Find this compound or compounds like it in BindingDB:
Activity Spreadsheet -- Enzyme Inhibition Constant Data from BindingDB
Found 4 hits for monomerid = 50097798
TargetBeta-2 adrenergic receptor(Homo sapiens (Human))
Wyeth-Ayerst Research
Curated by ChEMBL
LigandPNGBDBM50097798(CHEMBL163262 | N-[5-((R)-2-{1-[4-(2,4-Dioxo-thiazo...)
Affinity DataEC50:  1.19E+3nM. Assay description: Agonistic activity was assessed by measurement of cAMP accumulation levels in CHO cells expressing human beta-2-adrenergic receptor
In DepthDetails ArticlePubMed
TargetBeta-3 adrenergic receptor(Homo sapiens (Human))
Wyeth-Ayerst Research
Curated by ChEMBL
LigandPNGBDBM50097798(CHEMBL163262 | N-[5-((R)-2-{1-[4-(2,4-Dioxo-thiazo...)
Affinity DataEC50:  10nM. Assay description: Beta 3-adrenergic receptor agonistic activity as cAMP accumulation in CHO cells
In DepthDetails ArticlePubMed
TargetBeta-1 adrenergic receptor(Homo sapiens (Human))
Wyeth-Ayerst Research
Curated by ChEMBL
LigandPNGBDBM50097798(CHEMBL163262 | N-[5-((R)-2-{1-[4-(2,4-Dioxo-thiazo...)
Affinity DataEC50:  2.72E+3nM. Assay description: Agonistic activity as cAMP accumulation in CHO cells expressing human beta-1-adrenergic receptor
In DepthDetails ArticlePubMed
TargetBeta-3 adrenergic receptor(Homo sapiens (Human))
Wyeth-Ayerst Research
Curated by ChEMBL
LigandPNGBDBM50097798(CHEMBL163262 | N-[5-((R)-2-{1-[4-(2,4-Dioxo-thiazo...)
Affinity DataEC50:  10nM. Assay description: Agonistic activity as cAMP accumulation in CHO cells expressing human beta-3-andrenergic receptor
In DepthDetails ArticlePubMed