BDBM50098003 CHEMBL355301::N-Ethyl-2-(2-phenyl-1H-indol-3-yl)-N-pyridin-4-ylmethyl-acetamide
SMILES CCN(Cc1ccncc1)C(=O)Cc1c([nH]c2ccccc12)-c1ccccc1
InChI Key InChIKey=PVWYVGHJHHUPFS-UHFFFAOYSA-N
Data  12 IC50
  Tab Delimited (TSV)   2D SDfile   Computed 3D by Vconf -m prep SDfile
Find this compound or compounds like it in BindingDB:
Activity Spreadsheet -- Enzyme Inhibition Constant Data from BindingDB
Found 12 hits for monomerid = 50098003
TargetProtein farnesyltransferase subunit beta/geranylgeranyltransferase type-1 subunit alpha(Homo sapiens (Human))
Merck Research Laboratories
Curated by ChEMBL
LigandPNGBDBM50098003(CHEMBL355301 | N-Ethyl-2-(2-phenyl-1H-indol-3-yl)-...)
Affinity DataIC50:  54nM. Assay description: Inhibition of FPP incorporation into biotinylated K-Ras-derived peptide by human farnesyl transferase
In DepthDetails ArticlePubMed
TargetProtein farnesyltransferase subunit beta/geranylgeranyltransferase type-1 subunit alpha(Homo sapiens (Human))
Merck Research Laboratories
Curated by ChEMBL
LigandPNGBDBM50098003(CHEMBL355301 | N-Ethyl-2-(2-phenyl-1H-indol-3-yl)-...)
Affinity DataIC50:  4.00E+3nM. Assay description: Inhibition of FPP incorporation into biotinylated K-Ras-derived peptide by human farnesyl transferase
In DepthDetails ArticlePubMed
TargetProtein farnesyltransferase subunit beta/geranylgeranyltransferase type-1 subunit alpha(Homo sapiens (Human))
Merck Research Laboratories
Curated by ChEMBL
LigandPNGBDBM50098003(CHEMBL355301 | N-Ethyl-2-(2-phenyl-1H-indol-3-yl)-...)
Affinity DataIC50:  230nM. Assay description: Inhibition of FPP incorporation into biotinylated K-Ras-derived peptide by human farnesyl transferase
In DepthDetails ArticlePubMed
LigandPNGBDBM50098003(CHEMBL355301 | N-Ethyl-2-(2-phenyl-1H-indol-3-yl)-...)
Affinity DataIC50: >2.00E+4nM. Assay description: Inhibitory activity against human Geranylgeranyl transferase type I
In DepthDetails ArticlePubMed
TargetProtein farnesyltransferase subunit beta/geranylgeranyltransferase type-1 subunit alpha(Homo sapiens (Human))
Merck Research Laboratories
Curated by ChEMBL
LigandPNGBDBM50098003(CHEMBL355301 | N-Ethyl-2-(2-phenyl-1H-indol-3-yl)-...)
Affinity DataIC50:  230nM. Assay description: Inhibition of FPP incorporation into biotinylated K-Ras-derived peptide by human farnesyl transferase
In DepthDetails ArticlePubMed
TargetProtein farnesyltransferase subunit beta/geranylgeranyltransferase type-1 subunit alpha(Homo sapiens (Human))
Merck Research Laboratories
Curated by ChEMBL
LigandPNGBDBM50098003(CHEMBL355301 | N-Ethyl-2-(2-phenyl-1H-indol-3-yl)-...)
Affinity DataIC50:  250nM. Assay description: Inhibition of FPP incorporation into biotinylated K-Ras-derived peptide by human farnesyl transferase
In DepthDetails ArticlePubMed
TargetProtein farnesyltransferase subunit beta/geranylgeranyltransferase type-1 subunit alpha(Homo sapiens (Human))
Merck Research Laboratories
Curated by ChEMBL
LigandPNGBDBM50098003(CHEMBL355301 | N-Ethyl-2-(2-phenyl-1H-indol-3-yl)-...)
Affinity DataIC50:  106nM. Assay description: Concentration required for the inhibitory activity against human Farnesyltransferase
In DepthDetails ArticlePubMed
TargetProtein farnesyltransferase subunit beta/geranylgeranyltransferase type-1 subunit alpha(Homo sapiens (Human))
Merck Research Laboratories
Curated by ChEMBL
LigandPNGBDBM50098003(CHEMBL355301 | N-Ethyl-2-(2-phenyl-1H-indol-3-yl)-...)
Affinity DataIC50:  47nM. Assay description: Inhibition of FPP incorporation into biotinylated K-Ras-derived peptide by human farnesyl transferase with 5 nM ATP
In DepthDetails ArticlePubMed
TargetProtein farnesyltransferase subunit beta/geranylgeranyltransferase type-1 subunit alpha(Homo sapiens (Human))
Merck Research Laboratories
Curated by ChEMBL
LigandPNGBDBM50098003(CHEMBL355301 | N-Ethyl-2-(2-phenyl-1H-indol-3-yl)-...)
Affinity DataIC50:  190nM. Assay description: Inhibition of FPP incorporation into biotinylated K-Ras-derived peptide by human farnesyl transferase with 5 nM ATP
In DepthDetails ArticlePubMed
TargetProtein farnesyltransferase subunit beta/geranylgeranyltransferase type-1 subunit alpha(Homo sapiens (Human))
Merck Research Laboratories
Curated by ChEMBL
LigandPNGBDBM50098003(CHEMBL355301 | N-Ethyl-2-(2-phenyl-1H-indol-3-yl)-...)
Affinity DataIC50:  43nM. Assay description: Inhibition of FPP incorporation into biotinylated K-Ras-derived peptide by human farnesyl transferase with 5 nM ATP
In DepthDetails ArticlePubMed
TargetProtein farnesyltransferase subunit beta/geranylgeranyltransferase type-1 subunit alpha(Homo sapiens (Human))
Merck Research Laboratories
Curated by ChEMBL
LigandPNGBDBM50098003(CHEMBL355301 | N-Ethyl-2-(2-phenyl-1H-indol-3-yl)-...)
Affinity DataIC50:  65nM. Assay description: Inhibition of FPP incorporation into biotinylated K-Ras-derived peptide by human farnesyl transferase with 5 nM ATP
In DepthDetails ArticlePubMed
TargetProtein farnesyltransferase subunit beta/geranylgeranyltransferase type-1 subunit alpha(Homo sapiens (Human))
Merck Research Laboratories
Curated by ChEMBL
LigandPNGBDBM50098003(CHEMBL355301 | N-Ethyl-2-(2-phenyl-1H-indol-3-yl)-...)
Affinity DataIC50:  20nM. Assay description: Inhibition of FPP incorporation into biotinylated K-Ras-derived peptide by human farnesyl transferase 5 nM ATP
In DepthDetails ArticlePubMed