BDBM50098009 CHEMBL169997::N-Furan-2-ylmethyl-N-isopropyl-2-(2-phenyl-1H-indol-3-yl)-acetamide
SMILES CC(C)N(Cc1ccco1)C(=O)Cc1c([nH]c2ccccc12)-c1ccccc1
InChI Key InChIKey=ZVIFMCQHRKDJCS-UHFFFAOYSA-N
Data  1 IC50
  Tab Delimited (TSV)   2D SDfile   Computed 3D by Vconf -m prep SDfile
Find this compound or compounds like it in BindingDB:
Activity Spreadsheet -- Enzyme Inhibition Constant Data from BindingDB
Found 1 hit for monomerid = 50098009
TargetProtein farnesyltransferase subunit beta/geranylgeranyltransferase type-1 subunit alpha(Homo sapiens (Human))
Merck Research Laboratories
Curated by ChEMBL
LigandPNGBDBM50098009(CHEMBL169997 | N-Furan-2-ylmethyl-N-isopropyl-2-(2...)
Affinity DataIC50:  241nM. Assay description: Concentration required for the inhibitory activity against human Farnesyltransferase
In DepthDetails ArticlePubMed