BDBM50098020 2-[2-(3-Chloro-phenyl)-1H-indol-3-yl]-N-isopropyl-N-pyridin-4-ylmethyl-acetamide::CHEMBL169197
SMILES CC(C)N(Cc1ccncc1)C(=O)Cc1c([nH]c2ccccc12)-c1cccc(Cl)c1
InChI Key InChIKey=RNGUYINUWCVHET-UHFFFAOYSA-N
Data  1 IC50
  Tab Delimited (TSV)   2D SDfile   Computed 3D by Vconf -m prep SDfile
Find this compound or compounds like it in BindingDB:
Activity Spreadsheet -- Enzyme Inhibition Constant Data from BindingDB
Found 1 hit for monomerid = 50098020
TargetProtein farnesyltransferase subunit beta/geranylgeranyltransferase type-1 subunit alpha(Homo sapiens (Human))
Merck Research Laboratories
Curated by ChEMBL
LigandPNGBDBM50098020(2-[2-(3-Chloro-phenyl)-1H-indol-3-yl]-N-isopropyl-...)
Affinity DataIC50:  172nM. Assay description: Concentration required for the inhibitory activity against human Farnesyltransferase
In DepthDetails ArticlePubMed