BDBM50098021 CHEMBL169817::N-Isopropyl-2-[2-(2-methoxy-phenyl)-1H-indol-3-yl]-N-pyridin-4-ylmethyl-acetamide
SMILES COc1ccccc1-c1[nH]c2ccccc2c1CC(=O)N(Cc1ccncc1)C(C)C
InChI Key InChIKey=YNFYLZQERVSRSE-UHFFFAOYSA-N
Data  1 IC50
  Tab Delimited (TSV)   2D SDfile   Computed 3D by Vconf -m prep SDfile
Find this compound or compounds like it in BindingDB:
Activity Spreadsheet -- Enzyme Inhibition Constant Data from BindingDB
Found 1 hit for monomerid = 50098021
TargetProtein farnesyltransferase subunit beta/geranylgeranyltransferase type-1 subunit alpha(Homo sapiens (Human))
Merck Research Laboratories
Curated by ChEMBL
LigandPNGBDBM50098021(CHEMBL169817 | N-Isopropyl-2-[2-(2-methoxy-phenyl)...)
Affinity DataIC50:  1.37E+3nM. Assay description: Concentration required for the inhibitory activity against human Farnesyltransferase
In DepthDetails ArticlePubMed