BDBM50098030 CHEMBL169986::N-Cyclopropyl-2-(2-phenyl-1H-indol-3-yl)-N-pyridin-3-ylmethyl-acetamide
SMILES O=C(Cc1c([nH]c2ccccc12)-c1ccccc1)N(Cc1cccnc1)C1CC1
InChI Key InChIKey=AQFSLYDVQZALJV-UHFFFAOYSA-N
Data  1 IC50
  Tab Delimited (TSV)   2D SDfile   Computed 3D by Vconf -m prep SDfile
Find this compound or compounds like it in BindingDB:
Activity Spreadsheet -- Enzyme Inhibition Constant Data from BindingDB
Found 1 hit for monomerid = 50098030
TargetProtein farnesyltransferase subunit beta/geranylgeranyltransferase type-1 subunit alpha(Homo sapiens (Human))
Merck Research Laboratories
Curated by ChEMBL
LigandPNGBDBM50098030(CHEMBL169986 | N-Cyclopropyl-2-(2-phenyl-1H-indol-...)
Affinity DataIC50:  45nM. Assay description: Concentration required for the inhibitory activity against human Farnesyltransferase
In DepthDetails ArticlePubMed