BDBM50098792 CHEMBL3593343
SMILES CC(C)(C)c1cc(no1)C(=O)C(=N\Nc1cc(F)c(F)c(F)c1)\C#N
InChI Key InChIKey=SEZMJSSKKCJMPI-WSDLNYQXSA-N
Data  2 IC50
  Tab Delimited (TSV)   2D SDfile   Computed 3D by Vconf -m prep SDfile
Find this compound or compounds like it in BindingDB:
Activity Spreadsheet -- Enzyme Inhibition Constant Data from BindingDB
Found 2 hits for monomerid = 50098792
TargetRap guanine nucleotide exchange factor 3(Homo sapiens (Human))
University Of Texas Medical Branch
Curated by ChEMBL
LigandPNGBDBM50098792(CHEMBL3593343)
Affinity DataIC50:  8.90E+3nM. Assay description: Antagonist activity at human recombinant EPAC1 assessed as inhibition of Rap1b-bGDP exchange activity
In DepthDetails ArticlePubMed
TargetRap guanine nucleotide exchange factor 4(Mus musculus)
University Of Texas Medical Branch
Curated by ChEMBL
LigandPNGBDBM50098792(CHEMBL3593343)
Affinity DataIC50:  1.10E+3nM. Assay description: Displacement of 8-NBD-cAMP from mouse recombinant EPAC2 by fluorescence assay
In DepthDetails ArticlePubMed