BDBM50099161 CHEMBL177185::N-[5-(2-{1-[4-(2,4-Dioxo-thiazolidin-5-ylidenemethyl)-phenyl]-piperidin-4-ylamino}-1-hydroxy-ethyl)-2-hydroxy-phenyl]-methanesulfonamide
SMILES CS(=O)(=O)Nc1cc(ccc1O)C(O)CNC1CCN(CC1)c1ccc(C=C2SC(O)=NC2=O)cc1
InChI Key InChIKey=YMUVEBMQVDDYQI-UHFFFAOYSA-N
Data  2 EC50
  Tab Delimited (TSV)   2D SDfile   Computed 3D by Vconf -m prep SDfile
Find this compound or compounds like it in BindingDB:
Activity Spreadsheet -- Enzyme Inhibition Constant Data from BindingDB
Found 2 hits for monomerid = 50099161
TargetBeta-3 adrenergic receptor(Homo sapiens (Human))TBA
LigandPNGBDBM50099161(CHEMBL177185 | N-[5-(2-{1-[4-(2,4-Dioxo-thiazolidi...)
Affinity DataEC50:  6.00E+3nM. Assay description: Agonist activity against human beta3 adrenergic receptor expressed in CHO cells assessed as cAMP accumulation level
In DepthDetails PubMed
TargetBeta-3 adrenergic receptor(Homo sapiens (Human))TBA
LigandPNGBDBM50099161(CHEMBL177185 | N-[5-(2-{1-[4-(2,4-Dioxo-thiazolidi...)
Affinity DataEC50:  6nM. Assay description: Beta 3-adrenergic receptor agonistic activity, evaluated by measurement of cAMP accumulation in CHO cells.
In DepthDetails ArticlePubMed