BDBM50099167 CHEMBL369155::N'-[5-(4-{4-[(S)-2-Hydroxy-3-(4-hydroxy-phenoxy)-propylamino]-piperidin-1-yl}-benzylidene)-4-oxo-4,5-dihydro-thiazol-2-yl]-N,N-dimethyl-guanidine
SMILES CN(C)C(=N)NC1=NC(=O)C(S1)=Cc1ccc(cc1)N1CCC(CC1)NC[C@H](O)COc1ccc(O)cc1
InChI Key InChIKey=WYEDYMVEMZLAMY-QFIPXVFZSA-N
Data  1 EC50
  Tab Delimited (TSV)   2D SDfile   Computed 3D by Vconf -m prep SDfile
Find this compound or compounds like it in BindingDB:
Activity Spreadsheet -- Enzyme Inhibition Constant Data from BindingDB
Found 1 hit for monomerid = 50099167
TargetBeta-3 adrenergic receptor(Homo sapiens (Human))
Wyeth-Ayerst Research
Curated by ChEMBL
LigandPNGBDBM50099167(CHEMBL369155 | N'-[5-(4-{4-[(S)-2-Hydroxy-3-(4-hyd...)
Affinity DataEC50:  400nM. Assay description: Beta 3-adrenergic receptor agonistic activity, evaluated by measurement of cAMP accumulation in CHO cells.
In DepthDetails ArticlePubMed