BDBM50099248 1,9-diethyl-9-hydroxy-(9S)-2,3,9,10,13,15-hexahydro-1H,12H-[1,4]oxazino[3,2-f]pyrano[3',4':6,7]indolizino[1,2-b]quinoline-10,13-dione::CHEMBL445883
SMILES CCN1CCOc2ccc3nc-4c(Cn5c-4cc4c(COC(=O)[C@]4(O)CC)c5=O)cc3c12
InChI Key InChIKey=QBSRUCQTSRUKJR-DEOSSOPVSA-N
Data  1 IC50
  Tab Delimited (TSV)   2D SDfile   Computed 3D by Vconf -m prep SDfile
Find this compound or compounds like it in BindingDB:
Activity Spreadsheet -- Enzyme Inhibition Constant Data from BindingDB
Found 1 hit for monomerid = 50099248
TargetDNA topoisomerase 1(Mus musculus)
Life Science Research Center
Curated by ChEMBL
LigandPNGBDBM50099248(1,9-diethyl-9-hydroxy-(9S)-2,3,9,10,13,15-hexahydr...)
Affinity DataIC50:  1.20E+4nM. Assay description: Average concentration to cause 50% inhibition of topo 1 using the cleavable complex assay
In DepthDetails ArticlePubMed