BDBM50099262 2-Phenyl-3-piperidin-3-yl-1H-indole::3-(Piperidin-3-yl)-2-phenyl-1H-indole::CHEMBL42557
SMILES C1CNCC(C1)c1c([nH]c2ccccc12)-c1ccccc1
InChI Key InChIKey=FYHCOUIJWCQUMZ-UHFFFAOYSA-N
Data  5 KI  1 IC50
  Tab Delimited (TSV)   2D SDfile   Computed 3D by Vconf -m prep SDfile
Find this compound or compounds like it in BindingDB:
Activity Spreadsheet -- Enzyme Inhibition Constant Data from BindingDB
Found 6 hits for monomerid = 50099262
Target5-hydroxytryptamine receptor 2A(Homo sapiens (Human))
Merck Sharp And Dohme Research Laboratories
Curated by ChEMBL
LigandPNGBDBM50099262(2-Phenyl-3-piperidin-3-yl-1H-indole | 3-(Piperidin...)
Affinity DataKi:  0.990nM. Assay description: Ability to displace [3H]-ketanserin binding to human 5-hydroxytryptamine 2A receptor stably expressed in CHO cells
In DepthDetails ArticlePubMed
Target5-hydroxytryptamine receptor 2C(Homo sapiens (Human))
Merck Sharp And Dohme Research Laboratories
Curated by ChEMBL
LigandPNGBDBM50099262(2-Phenyl-3-piperidin-3-yl-1H-indole | 3-(Piperidin...)
Affinity DataKi:  89nM. Assay description: Ability to displace [3H]-mesulergine binding to human 5-hydroxytryptamine 2C receptor stably expressed in CHO cells
In DepthDetails ArticlePubMed
TargetD(2) dopamine receptor(Homo sapiens (Human))
Merck Sharp And Dohme Research Laboratories
Curated by ChEMBL
LigandPNGBDBM50099262(2-Phenyl-3-piperidin-3-yl-1H-indole | 3-(Piperidin...)
Affinity DataKi: >1.30E+3nM. Assay description: Ability to displace [3H]-spiperone binding to CHO cells stably expressing dopamine receptor D2
In DepthDetails ArticlePubMed
TargetPotassium voltage-gated channel subfamily H member 2(Homo sapiens (Human))
Astrazeneca
Curated by ChEMBL
LigandPNGBDBM50099262(2-Phenyl-3-piperidin-3-yl-1H-indole | 3-(Piperidin...)
Affinity DataKi:  4.90E+3nM. Assay description: Inhibition of human ERG channel
In DepthDetails ArticlePubMed
TargetPotassium voltage-gated channel subfamily H member 2(Homo sapiens (Human))
Astrazeneca
Curated by ChEMBL
LigandPNGBDBM50099262(2-Phenyl-3-piperidin-3-yl-1H-indole | 3-(Piperidin...)
Affinity DataKi:  4.90E+3nM. Assay description: Displacement of [3H]-dofetilide from HEK cells expressing hERG voltage dependent IKr potassium channel Kv11.1
In DepthDetails ArticlePubMed
TargetPotassium voltage-gated channel subfamily H member 2(Homo sapiens (Human))
Astrazeneca
Curated by ChEMBL
LigandPNGBDBM50099262(2-Phenyl-3-piperidin-3-yl-1H-indole | 3-(Piperidin...)
Affinity DataIC50:  4.90E+3nM. Assay description: Inhibition of human ERG
In DepthDetails ArticlePubMed