BDBM50100436 CHEMBL412768::NH2-Lys-Thr-Glu-Glu-Ile-Ser-Glu-Val-Asn
SMILES CC[C@H](C)[C@H](NC(=O)[C@H](CCC(O)=O)NC(=O)[C@H](CCC(O)=O)NC(=O)[C@@H](NC(=O)[C@@H](N)CCCCN)[C@@H](C)O)C(=O)N[C@@H](CO)C(=O)N[C@@H](CCC(O)=O)C(=O)N[C@@H](C(C)C)C(=O)N[C@@H](CC(N)=O)C(=O)N[C@@H](CC(C)C)[C@@H](O)CC(=O)N[C@@H](C(C)C)C(=O)N[C@@H](C)C(=O)N[C@@H](CCC(O)=O)C(=O)N[C@@H](Cc1ccccc1)C(O)=O
InChI Key InChIKey=CQTBDEGWLSDJEP-JMAXQNTPSA-N
Data  6 IC50
  Tab Delimited (TSV)   2D SDfile   Computed 3D by Vconf -m prep SDfile
Find this compound or compounds like it in BindingDB:
Activity Spreadsheet -- Enzyme Inhibition Constant Data from BindingDB
Found 6 hits for monomerid = 50100436
TargetBeta-secretase 1(Homo sapiens (Human))
Singapore Polytechnic
Curated by ChEMBL
LigandPNGBDBM50100436(CHEMBL412768 | NH2-Lys-Thr-Glu-Glu-Ile-Ser-Glu-Val...)
Affinity DataIC50:  120nM. Assay description: Inhibition of BACE1 using peptide substrate Rh-EVNLDAEFKQuencher by fluorescence resonance energy transfer (FRET) assay
In DepthDetails ArticlePubMed
TargetBeta-secretase 1(Homo sapiens (Human))
Singapore Polytechnic
Curated by ChEMBL
LigandPNGBDBM50100436(CHEMBL412768 | NH2-Lys-Thr-Glu-Glu-Ile-Ser-Glu-Val...)
Affinity DataIC50:  200nM. Assay description: Inhibition of recombinant human BACE1 using Rh-EVNLDAEFK as substrate after 60 mins by fluorescence quenching assay
In DepthDetails ArticlePubMed
TargetBeta-secretase 1(Homo sapiens (Human))
Singapore Polytechnic
Curated by ChEMBL
LigandPNGBDBM50100436(CHEMBL412768 | NH2-Lys-Thr-Glu-Glu-Ile-Ser-Glu-Val...)
Affinity DataIC50:  200nM. Assay description: Inhibition of recombinant human BACE1 using Rh-EVNLDAEFK-Quencher as substrate after 60 mins by FRET assay
In DepthDetails ArticlePubMed
TargetBeta-secretase 1/2(Homo sapiens (Human))
Harvard Medical School
Curated by ChEMBL
LigandPNGBDBM50100436(CHEMBL412768 | NH2-Lys-Thr-Glu-Glu-Ile-Ser-Glu-Val...)
Affinity DataIC50:  30nM. Assay description: In vitro inhibition of beta-secretase was evaluated
In DepthDetails ArticlePubMed
TargetBeta-secretase 1(Homo sapiens (Human))
Singapore Polytechnic
Curated by ChEMBL
LigandPNGBDBM50100436(CHEMBL412768 | NH2-Lys-Thr-Glu-Glu-Ile-Ser-Glu-Val...)
Affinity DataIC50:  200nM. Assay description: Inhibition of recombinant human BACE1
In DepthDetails ArticlePubMed
TargetBeta-secretase 1(Homo sapiens (Human))
Singapore Polytechnic
Curated by ChEMBL
LigandPNGBDBM50100436(CHEMBL412768 | NH2-Lys-Thr-Glu-Glu-Ile-Ser-Glu-Val...)
Affinity DataIC50:  30nM. Assay description: Inhibition of human brain beta-secretase, using MBPC125Swe (maltose-binding-protein C-125 Swedish) assay
In DepthDetails ArticlePubMed