BDBM50100923 CHEMBL41943::N-[(R)-2-(4,4-Dimethyl-2,5-dioxo-imidazolidin-1-yl)-1-(4'-trifluoromethoxy-biphenyl-4-yloxymethyl)-ethyl]-N-hydroxy-formamide
SMILES CC1(C)NC(=O)N(C[C@H](COc2ccc(cc2)-c2ccc(OC(F)(F)F)cc2)N(O)C=O)C1=O
InChI Key InChIKey=IIHFBHZWJNGWRC-MRXNPFEDSA-N
Data  10 IC50
  Tab Delimited (TSV)   2D SDfile   Computed 3D by Vconf -m prep SDfile
Find this compound or compounds like it in BindingDB:
Activity Spreadsheet -- Enzyme Inhibition Constant Data from BindingDB
Found 10 hits for monomerid = 50100923
TargetMatrix metalloproteinase-9(Homo sapiens (Human))
Abbott Laboratories
Curated by ChEMBL
LigandPNGBDBM50100923(CHEMBL41943 | N-[(R)-2-(4,4-Dimethyl-2,5-dioxo-imi...)
Affinity DataIC50:  1.20E+3nM. Assay description: Inhibition of matrix metalloproteinase-9
In DepthDetails ArticlePubMed
Target72 kDa type IV collagenase(Homo sapiens (Human))
Abbott Laboratories
Curated by ChEMBL
LigandPNGBDBM50100923(CHEMBL41943 | N-[(R)-2-(4,4-Dimethyl-2,5-dioxo-imi...)
Affinity DataIC50:  180nM. Assay description: In vitro inhibition of human Matrix metalloproteinase-2.
In DepthDetails ArticlePubMed
TargetStromelysin-1(Homo sapiens (Human))
Abbott Laboratories
Curated by ChEMBL
LigandPNGBDBM50100923(CHEMBL41943 | N-[(R)-2-(4,4-Dimethyl-2,5-dioxo-imi...)
Affinity DataIC50:  3.10E+3nM. Assay description: Inhibition of Matrix metalloproteinase-3
In DepthDetails ArticlePubMed
TargetInterstitial collagenase(Homo sapiens (Human))
Abbott Laboratories
Curated by ChEMBL
LigandPNGBDBM50100923(CHEMBL41943 | N-[(R)-2-(4,4-Dimethyl-2,5-dioxo-imi...)
Affinity DataIC50: >1.00E+4nM. Assay description: In vitro inhibition of human Matrix metalloproteinase-1.
In DepthDetails ArticlePubMed
TargetMatrix metalloproteinase-9(Homo sapiens (Human))
Abbott Laboratories
Curated by ChEMBL
LigandPNGBDBM50100923(CHEMBL41943 | N-[(R)-2-(4,4-Dimethyl-2,5-dioxo-imi...)
Affinity DataIC50:  1.20E+3nM. Assay description: Inhibition of MMP-9 (unknown origin)
In DepthDetails PubMed
TargetInterstitial collagenase(Homo sapiens (Human))
Abbott Laboratories
Curated by ChEMBL
LigandPNGBDBM50100923(CHEMBL41943 | N-[(R)-2-(4,4-Dimethyl-2,5-dioxo-imi...)
Affinity DataIC50: >1.00E+4nM. Assay description: Inhibition of MMP-1 (unknown origin)
In DepthDetails PubMed
Target72 kDa type IV collagenase(Homo sapiens (Human))
Abbott Laboratories
Curated by ChEMBL
LigandPNGBDBM50100923(CHEMBL41943 | N-[(R)-2-(4,4-Dimethyl-2,5-dioxo-imi...)
Affinity DataIC50:  180nM. Assay description: Inhibition of MMP-2 (unknown origin)
In DepthDetails PubMed
TargetStromelysin-1(Homo sapiens (Human))
Abbott Laboratories
Curated by ChEMBL
LigandPNGBDBM50100923(CHEMBL41943 | N-[(R)-2-(4,4-Dimethyl-2,5-dioxo-imi...)
Affinity DataIC50:  3.10E+3nM. Assay description: Inhibition of MMP-3 (unknown origin)
In DepthDetails PubMed
TargetMatrilysin(Homo sapiens (Human))
Jadavpur University
Curated by ChEMBL
LigandPNGBDBM50100923(CHEMBL41943 | N-[(R)-2-(4,4-Dimethyl-2,5-dioxo-imi...)
Affinity DataIC50: >1.00E+4nM. Assay description: Inhibition of MMP-7 (unknown origin)
In DepthDetails PubMed
TargetMatrilysin(Homo sapiens (Human))
Jadavpur University
Curated by ChEMBL
LigandPNGBDBM50100923(CHEMBL41943 | N-[(R)-2-(4,4-Dimethyl-2,5-dioxo-imi...)
Affinity DataIC50: >1.00E+4nM. Assay description: Inhibition of Matrix metalloproteinase-7
In DepthDetails ArticlePubMed